rating_agency_name,file_creating_date,sec_category,issuer_name,legal_entity_identifier,object_type_rated,instrument_name,CUSIP_number,coupon_date,maturity_date,par_value,issued_paid,rating,rating_action_date,rating_action_class,rating_type,rating_sub_type,rating_type_term,other_announcement_type,watch_status,rating_outlook,issuer_identifier,issuer_identifier_schema,instrument_identifier,instrument_identifier_schema,central_index_key,obligor_identifier,obligor_identifier_schema,obligor_identifier_other,obligor_sec_category,obligor_industry_group,obligor_name
Moody's Investors Service,2022-05-15,,,,,,,,,,false,Baa3,2012-06-15,HS,Organization,,LT Issuer Rating,,,,,,,,,2507,NRSRO,,Insurance,,Ageas N.V.
Moody's Investors Service,2022-05-15,,,,,,,,,,true,WR,2012-08-14,WO,Organization,,LT Issuer Rating,,,,,,,,,2507,NRSRO,,Insurance,,Ageas N.V.
Moody's Investors Service,2022-05-15,Insurance,Prudential Public Limited Company,5493001Z3ZE83NGK8Y12,Instrument,EURO MEDIUM TERM NOTES,,3.375,2013-01-28,250.00,false,A2,2012-06-15,HS,Instrument,,Senior Unsecured,,,,2602,NRSRO,821944223,NRSRO,,,,,,,
Moody's Investors Service,2022-05-15,Insurance,Prudential Public Limited Company,5493001Z3ZE83NGK8Y12,Instrument,EURO MEDIUM TERM NOTES,,3.375,2013-01-28,250.00,true,WR,2013-01-28,WE,Instrument,,Senior Unsecured,,,,2602,NRSRO,821944223,NRSRO,,,,,,,
Moody's Investors Service,2022-05-15,Insurance,Prudential Public Limited Company,5493001Z3ZE83NGK8Y12,Instrument,EURO MEDIUM TERM NOTES,,1.25,2015-11-16,300.00,false,A2,2012-11-14,NW,Instrument,,Senior Unsecured,,,,2602,NRSRO,823254690,NRSRO,,,,,,,
Moody's Investors Service,2022-05-15,Insurance,Prudential Public Limited Company,5493001Z3ZE83NGK8Y12,Instrument,EURO MEDIUM TERM NOTES,,1.25,2015-11-16,300.00,true,WR,2015-11-16,WE,Instrument,,Senior Unsecured,,,,2602,NRSRO,823254690,NRSRO,,,,,,,
Moody's Investors Service,2022-05-15,Insurance,Prudential Public Limited Company,5493001Z3ZE83NGK8Y12,Instrument,EURO MEDIUM TERM NOTES,,1.375,2018-01-19,300.00,true,A2,2015-01-14,NW,Instrument,,Senior Unsecured,,,,2602,NRSRO,824321103,NRSRO,,,,,,,
Moody's Investors Service,2022-05-15,Insurance,Prudential Public Limited Company,5493001Z3ZE83NGK8Y12,Instrument,EURO MEDIUM TERM NOTES,,1.375,2018-01-19,300.00,true,WR,2018-01-19,WE,Instrument,,Senior Unsecured,,,,2602,NRSRO,824321103,NRSRO,,,,,,,
Moody's Investors Service,2022-05-15,Insurance,Prudential Public Limited Company,5493001Z3ZE83NGK8Y12,Instrument,EURO MEDIUM TERM NOTES,,1.75,2018-11-27,300.00,true,A2,2015-11-26,NW,Instrument,,Senior Unsecured,,,,2602,NRSRO,824809078,NRSRO,,,,,,,
Moody's Investors Service,2022-05-15,Insurance,Prudential Public Limited Company,5493001Z3ZE83NGK8Y12,Instrument,EURO MEDIUM TERM NOTES,,1.75,2018-11-27,300.00,true,WR,2018-11-27,WE,Instrument,,Senior Unsecured,,,,2602,NRSRO,824809078,NRSRO,,,,,,,
Moody's Investors Service,2022-05-15,Insurance,Prudential Public Limited Company,5493001Z3ZE83NGK8Y12,Instrument,EUROBONDS,,6.875,2023-01-20,300.00,false,A2,2012-06-15,HS,Instrument,,Senior Unsecured,,,,2602,NRSRO,10180003,NRSRO,,,,,,,
Moody's Investors Service,2022-05-15,Insurance,Prudential Public Limited Company,5493001Z3ZE83NGK8Y12,Instrument,SR SUB EUROBONDS,,6.125,2031-12-19,435.00,false,A3,2012-06-15,HS,Instrument,,Senior Subordinate,,,,2602,NRSRO,10310867,NRSRO,,,,,,,
Moody's Investors Service,2022-05-15,Insurance,"Mitsui Sumitomo Insurance Company, Limited",5493006KRZ0SJO41LZ83,Instrument,SUB FIX/FLT RT GLOBAL NOTES,606839AA6,,2072-03-15,1300.00,false,A3,2012-06-15,HS,Instrument,,Subordinate,,,,3038,NRSRO,,,,,,,,,
Moody's Investors Service,2022-05-15,Insurance,"Mitsui Sumitomo Insurance Company, Limited",5493006KRZ0SJO41LZ83,Instrument,SUB FIX/FLT RT GLOBAL NOTES,606839AB4,4.95,,910.00,false,A3,2019-02-28,NW,Instrument,,Subordinate,,,,3038,NRSRO,,,,,,,,,
Moody's Investors Service,2022-05-15,Insurance,AEGON N.V.,O4QK7KMMK83ITNTHUG69,Instrument,EURO MEDIUM TERM NOTES,,6.125,2031-12-15,250.00,false,A3,2012-06-15,HS,Instrument,,Senior Unsecured,,,,9535,NRSRO,10248710,NRSRO,,,,,,,
Moody's Investors Service,2022-05-15,Insurance,AEGON N.V.,O4QK7KMMK83ITNTHUG69,Instrument,EURO MEDIUM TERM NOTES,,4.125,2014-12-08,500.00,false,A3,2012-06-15,HS,Instrument,,Senior Unsecured,,,,9535,NRSRO,807977973,NRSRO,,,,,,,
Moody's Investors Service,2022-05-15,Insurance,AEGON N.V.,O4QK7KMMK83ITNTHUG69,Instrument,EURO MEDIUM TERM NOTES,,4.125,2014-12-08,500.00,true,WR,2014-12-08,WE,Instrument,,Senior Unsecured,,,,9535,NRSRO,807977973,NRSRO,,,,,,,
Moody's Investors Service,2022-05-15,Insurance,AEGON N.V.,O4QK7KMMK83ITNTHUG69,Instrument,EURO MEDIUM TERM NOTES,,6.625,2039-12-16,400.00,false,A3,2012-06-15,HS,Instrument,,Senior Unsecured,,,,9535,NRSRO,821901726,NRSRO,,,,,,,
Moody's Investors Service,2022-05-15,Insurance,AEGON N.V.,O4QK7KMMK83ITNTHUG69,Instrument,EURO MEDIUM TERM NOTES,,3.0,2017-07-18,500.00,false,A3,2012-07-13,NW,Instrument,,Senior Unsecured,,,,9535,NRSRO,823187435,NRSRO,,,,,,,
Moody's Investors Service,2022-05-15,Insurance,AEGON N.V.,O4QK7KMMK83ITNTHUG69,Instrument,EURO MEDIUM TERM NOTES,,3.0,2017-07-18,500.00,true,WR,2017-07-18,WE,Instrument,,Senior Unsecured,,,,9535,NRSRO,823187435,NRSRO,,,,,,,
Moody's Investors Service,2022-05-15,Insurance,AEGON N.V.,O4QK7KMMK83ITNTHUG69,Instrument,EURO MEDIUM TERM NOTES,,1.0,2023-12-08,500.00,true,A3,2016-12-06,NW,Instrument,,Senior Unsecured,,,,9535,NRSRO,825359385,NRSRO,,,,,,,
Moody's Investors Service,2022-05-15,Insurance,AEGON N.V.,O4QK7KMMK83ITNTHUG69,Instrument,SUB FIX/FLT RT EURO MTNS,,4.0,2044-04-25,700.00,true,Baa1,2014-04-23,NW,Instrument,,Subordinate,,,,9535,NRSRO,823911533,NRSRO,,,,,,,
Moody's Investors Service,2022-05-15,Insurance,AEGON N.V.,O4QK7KMMK83ITNTHUG69,Instrument,ZERO CPN EURO MTNS,,0.0,2018-08-30,500.00,true,A3,2017-08-29,NW,Instrument,,Senior Unsecured,,,,9535,NRSRO,825715106,NRSRO,,,,,,,
Moody's Investors Service,2022-05-15,Insurance,AEGON N.V.,O4QK7KMMK83ITNTHUG69,Instrument,ZERO CPN EURO MTNS,,0.0,2018-08-30,500.00,true,WR,2018-08-30,WE,Instrument,,Senior Unsecured,,,,9535,NRSRO,825715106,NRSRO,,,,,,,
Moody's Investors Service,2022-05-15,Insurance,AIG Management France S.A.,6P5JGUEW3H1Z7SZNLA52,Instrument,GTD FIX/FLT RT EURO MTNS,,3.0,2023-11-27,500.00,true,Baa1,2012-06-15,HS,Instrument,,Backed Senior Unsecured,,,,10930,NRSRO,808028423,NRSRO,,,,,,,
Moody's Investors Service,2022-05-15,Insurance,AIG Management France S.A.,6P5JGUEW3H1Z7SZNLA52,Instrument,GTD FIX/FLT RT EURO MTNS,,3.0,2023-11-27,500.00,true,WR,2020-02-18,WO,Instrument,,Backed Senior Unsecured,,,,10930,NRSRO,808028423,NRSRO,,,,,,,
Moody's Investors Service,2022-05-15,,,X61PBER9R1WWNCJBUQ76,,,,,,,false,Aa2,2012-06-15,HS,Organization,,Insurance Financial Strength,,,,,,,,,11000,NRSRO,,Insurance,,Travelers Casualty and Surety Company
Moody's Investors Service,2022-05-15,,,,,,,,,,false,Aa2,2012-06-15,HS,Organization,,Insurance Financial Strength,,,,,,,,,11040,NRSRO,,Insurance,,Travelers Casualty Insurance Co. of America
Moody's Investors Service,2022-05-15,,,,,,,,,,false,Aa2,2012-06-15,HS,Organization,,Insurance Financial Strength,,,,,,,,,11620,NRSRO,,Insurance,,National Continental Insurance Co.
Moody's Investors Service,2022-05-15,,,,,,,,,,false,Aa2,2012-06-15,HS,Organization,,Insurance Financial Strength,,,,,,,,,11670,NRSRO,,Insurance,,United Financial Casualty Co.
Moody's Investors Service,2022-05-15,,,,,,,,,,false,Aa2,2012-06-15,HS,Organization,,Insurance Financial Strength,,,,,,,,,11720,NRSRO,,Insurance,,Progressive Classic Insurance Company
Moody's Investors Service,2022-05-15,,,,,,,,,,false,Aa2,2012-06-15,HS,Organization,,Insurance Financial Strength,,,,,,,,,11770,NRSRO,,Insurance,,Progressive Mountain Insur. Co.
Moody's Investors Service,2022-05-15,,,,,,,,,,false,Aa2,2012-06-15,HS,Organization,,Insurance Financial Strength,,,,,,,,,11820,NRSRO,,Insurance,,Progressive Northwest. Insurance Co.
Moody's Investors Service,2022-05-15,,,,,,,,,,false,Aa2,2012-06-15,HS,Organization,,Insurance Financial Strength,,,,,,,,,11870,NRSRO,,Insurance,,Progressive Gulf Insurance Co.
Moody's Investors Service,2022-05-15,,,,,,,,,,false,Aa2,2012-06-15,HS,Organization,,Insurance Financial Strength,,,,,,,,,11920,NRSRO,,Insurance,,Progressive Southeastern Insurance Co.
Moody's Investors Service,2022-05-15,,,,,,,,,,false,Aa2,2012-06-15,HS,Organization,,Insurance Financial Strength,,,,,,,,,11970,NRSRO,,Insurance,,Progressive Northern Insurance Co.
Moody's Investors Service,2022-05-15,,,SPCOIWBJM0HFYQX3A364,,,,,,,false,A1,2012-06-15,HS,Organization,,Insurance Financial Strength,,,,,,,,,12000,NRSRO,,Insurance,,Aetna Life Insurance Company
Moody's Investors Service,2022-05-15,,,SPCOIWBJM0HFYQX3A364,,,,,,,true,A2,2013-05-07,DG,Organization,,Insurance Financial Strength,,,,,,,,,12000,NRSRO,,Insurance,,Aetna Life Insurance Company
Moody's Investors Service,2022-05-15,,,SPCOIWBJM0HFYQX3A364,,,,,,,true,A1,2015-05-14,UP,Organization,,Insurance Financial Strength,,,,,,,,,12000,NRSRO,,Insurance,,Aetna Life Insurance Company
Moody's Investors Service,2022-05-15,,,SPCOIWBJM0HFYQX3A364,,,,,,,true,A2,2016-06-02,DG,Organization,,Insurance Financial Strength,,,,,,,,,12000,NRSRO,,Insurance,,Aetna Life Insurance Company
Moody's Investors Service,2022-05-15,,,SPCOIWBJM0HFYQX3A364,,,,,,,false,A2,2012-06-15,HS,Organization,,LT Issuer Rating,,,,,,,,,12000,NRSRO,,Insurance,,Aetna Life Insurance Company
Moody's Investors Service,2022-05-15,,,SPCOIWBJM0HFYQX3A364,,,,,,,true,A3,2013-05-07,DG,Organization,,LT Issuer Rating,,,,,,,,,12000,NRSRO,,Insurance,,Aetna Life Insurance Company
Moody's Investors Service,2022-05-15,,,SPCOIWBJM0HFYQX3A364,,,,,,,true,A2,2015-05-14,UP,Organization,,LT Issuer Rating,,,,,,,,,12000,NRSRO,,Insurance,,Aetna Life Insurance Company
Moody's Investors Service,2022-05-15,,,SPCOIWBJM0HFYQX3A364,,,,,,,true,A3,2016-06-02,DG,Organization,,LT Issuer Rating,,,,,,,,,12000,NRSRO,,Insurance,,Aetna Life Insurance Company
Moody's Investors Service,2022-05-15,,,SPCOIWBJM0HFYQX3A364,,,,,,,true,WR,2020-06-30,WO,Organization,,LT Issuer Rating,,,,,,,,,12000,NRSRO,,Insurance,,Aetna Life Insurance Company
Moody's Investors Service,2022-05-15,,,,,,,,,,false,Aa2,2012-06-15,HS,Organization,,Insurance Financial Strength,,,,,,,,,12030,NRSRO,,Insurance,,Progressive Preferred Insurance Co.
Moody's Investors Service,2022-05-15,,,,,,,,,,false,Aa2,2012-06-15,HS,Organization,,Insurance Financial Strength,,,,,,,,,12080,NRSRO,,Insurance,,Progressive Specialty Insurance Co.
Moody's Investors Service,2022-05-15,,,,,,,,,,false,Aa2,2012-06-15,HS,Organization,,Insurance Financial Strength,,,,,,,,,12130,NRSRO,,Insurance,,Progressive American Insurance Co.
Moody's Investors Service,2022-05-15,,,549300K1BVLH9IO4S405,,,,,,,true,A2,2012-06-15,HS,Organization,,Insurance Financial Strength,,,,,,,,,12680,NRSRO,,Insurance,,Variable Annuity Life Insurance Company
Moody's Investors Service,2022-05-15,Insurance,Voya Holdings Inc.,,Instrument,GTD DEBENTURE,008117AG8,7.25,2023-08-15,200.00,true,A3,2012-06-15,HS,Instrument,,Backed Senior Unsecured,,,,,,,,0001577976,,,,,,
Moody's Investors Service,2022-05-15,Insurance,Voya Holdings Inc.,,Instrument,GTD DEBENTURE,008117AG8,7.25,2023-08-15,200.00,true,Baa1,2015-08-18,DG,Instrument,,Backed Senior Unsecured,,,,,,,,0001577976,,,,,,
Moody's Investors Service,2022-05-15,Insurance,Voya Holdings Inc.,,Instrument,GTD DEBENTURE,008117AH6,7.625,2026-08-15,450.00,true,A3,2012-06-15,HS,Instrument,,Backed Senior Unsecured,,,,,,,,0001577976,,,,,,
Moody's Investors Service,2022-05-15,Insurance,Voya Holdings Inc.,,Instrument,GTD DEBENTURE,008117AH6,7.625,2026-08-15,450.00,true,Baa1,2015-08-18,DG,Instrument,,Backed Senior Unsecured,,,,,,,,0001577976,,,,,,
Moody's Investors Service,2022-05-15,Insurance,Voya Holdings Inc.,,Instrument,GTD DEBENTURE,008117AJ2,6.97,2036-08-15,300.00,true,A3,2012-06-15,HS,Instrument,,Backed Senior Unsecured,,,,,,,,0001577976,,,,,,
Moody's Investors Service,2022-05-15,Insurance,Voya Holdings Inc.,,Instrument,GTD DEBENTURE,008117AJ2,6.97,2036-08-15,300.00,true,Baa1,2015-08-18,DG,Instrument,,Backed Senior Unsecured,,,,,,,,0001577976,,,,,,
Moody's Investors Service,2022-05-15,,,549300KVA8DBYKHPXO21,,,,,,,true,A2,2012-06-15,HS,Organization,,Insurance Financial Strength,,,,,,,,,17980,NRSRO,,Insurance,,Standard Insurance Company
Moody's Investors Service,2022-05-15,,,549300KVA8DBYKHPXO21,,,,,,,true,A1,2017-10-03,UP,Organization,,Insurance Financial Strength,,,,,,,,,17980,NRSRO,,Insurance,,Standard Insurance Company
Moody's Investors Service,2022-05-15,,,,,,,,,,false,Aa1,2012-06-15,HS,Organization,,Insurance Financial Strength,,,,,,,,0000201998,21850,,,Insurance,,Government Employees Insurance Company
Moody's Investors Service,2022-05-15,,,,,,,,,,false,A2,2012-06-15,HS,Organization,,Insurance Financial Strength,,,,,,,,0001127802,21870,,,Insurance,,Skandia Insurance Company Ltd.
Moody's Investors Service,2022-05-15,,,,,,,,,,true,WR,2021-01-27,WO,Organization,,Insurance Financial Strength,,,,,,,,0001127802,21870,,,Insurance,,Skandia Insurance Company Ltd.
Moody's Investors Service,2022-05-15,Insurance,GEICO Corporation,,Instrument,DEBENTURES,361582AD1,7.35,2023-07-15,150.00,false,Aa3,2012-06-15,HS,Instrument,,Senior Unsecured,,,,,,,,0000277795,,,,,,
Moody's Investors Service,2022-05-15,Insurance,Alleghany Corporation,,Instrument,SR GLOBAL NOTES,017175AC4,4.95,2022-06-27,400.00,false,Baa2,2012-06-21,NW,Instrument,,Senior Unsecured,,,,,,,,0000775368,,,,,,
Moody's Investors Service,2022-05-15,Insurance,Alleghany Corporation,,Instrument,SR GLOBAL NOTES,017175AC4,4.95,2022-06-27,400.00,true,Baa1,2016-01-27,UP,Instrument,,Senior Unsecured,,,,,,,,0000775368,,,,,,
Moody's Investors Service,2022-05-15,Insurance,Alleghany Corporation,,Instrument,SR NOTES,017175AB6,5.625,2020-09-15,300.00,false,Baa2,2012-06-15,HS,Instrument,,Senior Unsecured,,,,,,,,0000775368,,,,,,
Moody's Investors Service,2022-05-15,Insurance,Alleghany Corporation,,Instrument,SR NOTES,017175AB6,5.625,2020-09-15,300.00,true,Baa1,2016-01-27,UP,Instrument,,Senior Unsecured,,,,,,,,0000775368,,,,,,
Moody's Investors Service,2022-05-15,Insurance,Alleghany Corporation,,Instrument,SR NOTES,017175AB6,5.625,2020-09-15,300.00,true,WR,2020-01-24,WO,Instrument,,Senior Unsecured,,,,,,,,0000775368,,,,,,
Moody's Investors Service,2022-05-15,Insurance,Alleghany Corporation,,Instrument,SR NOTES,017175AD2,4.9,2044-09-15,300.00,true,Baa2,2014-09-02,NW,Instrument,,Senior Unsecured,,,,,,,,0000775368,,,,,,
Moody's Investors Service,2022-05-15,Insurance,Alleghany Corporation,,Instrument,SR NOTES,017175AD2,4.9,2044-09-15,300.00,true,Baa1,2016-01-27,UP,Instrument,,Senior Unsecured,,,,,,,,0000775368,,,,,,
Moody's Investors Service,2022-05-15,Insurance,Alleghany Corporation,,Instrument,SR NOTES,017175AE0,3.625,2030-05-15,500.00,true,Baa1,2020-05-13,NW,Instrument,,Senior Unsecured,,,,,,,,0000775368,,,,,,
Moody's Investors Service,2022-05-15,,,AQTLXZVK5OMMNN0Q8P21,,,,,,,true,A1,2013-08-08,NW,Organization,,Insurance Financial Strength,,,,,,,,,22740,NRSRO,,Insurance,,Lexington Insurance Company
Moody's Investors Service,2022-05-15,,,AQTLXZVK5OMMNN0Q8P21,,,,,,,true,A2,2016-01-26,DG,Organization,,Insurance Financial Strength,,,,,,,,,22740,NRSRO,,Insurance,,Lexington Insurance Company
Moody's Investors Service,2022-05-15,Insurance,"AIG Life Holdings, Inc.",5493001FBIY3WQ6U5014,Instrument,GTD NOTES,026351AU0,7.5,2025-07-15,150.00,true,Baa1,2012-06-15,HS,Instrument,,Backed Senior Unsecured,,,,42500,NRSRO,,,,,,,,,
Moody's Investors Service,2022-05-15,Insurance,"AIG Life Holdings, Inc.",5493001FBIY3WQ6U5014,Instrument,GTD SR NOTES,026351AZ9,6.625,2029-02-15,150.00,true,Baa1,2012-06-15,HS,Instrument,,Backed Senior Unsecured,,,,42500,NRSRO,,,,,,,,,
Moody's Investors Service,2022-05-15,Insurance,"AIG Life Holdings, Inc.",5493001FBIY3WQ6U5014,Instrument,JR SUB NOTES,00138GAA7,8.5,2030-07-01,300.00,true,Baa2,2013-08-01,NW,Instrument,,Backed Junior Subordinate,,,,42500,NRSRO,,,,,,,,,
Moody's Investors Service,2022-05-15,Insurance,"AIG Life Holdings, Inc.",5493001FBIY3WQ6U5014,Instrument,JR SUB NOTES,00138GAB5,7.57,2045-12-01,500.00,true,Baa2,2013-08-01,NW,Instrument,,Backed Junior Subordinate,,,,42500,NRSRO,,,,,,,,,
Moody's Investors Service,2022-05-15,Insurance,"AIG Life Holdings, Inc.",5493001FBIY3WQ6U5014,Instrument,JR SUB NOTES,00138GAC3,8.125,2046-03-15,500.00,true,Baa2,2013-08-01,NW,Instrument,,Backed Junior Subordinate,,,,42500,NRSRO,,,,,,,,,
Moody's Investors Service,2022-05-15,Insurance,"American International Group, Inc.",ODVCVCQG2BP6VHV36M30,Instrument,EURO MEDIUM TERM NOTES,,4.375,2016-04-26,750.00,true,Baa1,2012-06-15,HS,Instrument,,Senior Unsecured,,,,45500,NRSRO,809397091,NRSRO,,,,,,,
Moody's Investors Service,2022-05-15,Insurance,"American International Group, Inc.",ODVCVCQG2BP6VHV36M30,Instrument,EURO MEDIUM TERM NOTES,,4.375,2016-04-26,750.00,true,WR,2016-04-26,WE,Instrument,,Senior Unsecured,,,,45500,NRSRO,809397091,NRSRO,,,,,,,
Moody's Investors Service,2022-05-15,Insurance,"American International Group, Inc.",ODVCVCQG2BP6VHV36M30,Instrument,EURO MEDIUM TERM NOTES,,5.0,2023-04-26,500.00,true,Baa1,2012-06-15,HS,Instrument,,Senior Unsecured,,,,45500,NRSRO,809400762,NRSRO,,,,,,,
Moody's Investors Service,2022-05-15,Insurance,"American International Group, Inc.",ODVCVCQG2BP6VHV36M30,Instrument,EURO MEDIUM TERM NOTES,,2.275,2016-08-08,5000.00,true,Baa1,2012-06-15,HS,Instrument,,Senior Unsecured,,,,45500,NRSRO,809705472,NRSRO,,,,,,,
Moody's Investors Service,2022-05-15,Insurance,"American International Group, Inc.",ODVCVCQG2BP6VHV36M30,Instrument,EURO MEDIUM TERM NOTES,,2.275,2016-08-08,5000.00,true,WR,2016-08-08,WE,Instrument,,Senior Unsecured,,,,45500,NRSRO,809705472,NRSRO,,,,,,,
Moody's Investors Service,2022-05-15,Insurance,"American International Group, Inc.",ODVCVCQG2BP6VHV36M30,Instrument,EURO MEDIUM TERM NOTES,,8.59,2016-09-15,1000.00,true,Baa1,2012-06-15,HS,Instrument,,Senior Unsecured,,,,45500,NRSRO,809768514,NRSRO,,,,,,,
Moody's Investors Service,2022-05-15,Insurance,"American International Group, Inc.",ODVCVCQG2BP6VHV36M30,Instrument,EURO MEDIUM TERM NOTES,,8.59,2016-09-15,1000.00,true,WR,2016-09-15,WE,Instrument,,Senior Unsecured,,,,45500,NRSRO,809768514,NRSRO,,,,,,,
Moody's Investors Service,2022-05-15,Insurance,"American International Group, Inc.",ODVCVCQG2BP6VHV36M30,Instrument,EURO MEDIUM TERM NOTES,,2.5,2026-10-13,4500.00,true,Baa1,2012-06-15,HS,Instrument,,Senior Unsecured,,,,45500,NRSRO,809844832,NRSRO,,,,,,,
Moody's Investors Service,2022-05-15,Insurance,"American International Group, Inc.",ODVCVCQG2BP6VHV36M30,Instrument,EURO MEDIUM TERM NOTES,,2.75,2016-12-21,250.00,true,Baa1,2012-06-15,HS,Instrument,,Senior Unsecured,,,,45500,NRSRO,815019321,NRSRO,,,,,,,
Moody's Investors Service,2022-05-15,Insurance,"American International Group, Inc.",ODVCVCQG2BP6VHV36M30,Instrument,EURO MEDIUM TERM NOTES,,2.75,2016-12-21,250.00,true,WR,2016-12-21,WE,Instrument,,Senior Unsecured,,,,45500,NRSRO,815019321,NRSRO,,,,,,,
Moody's Investors Service,2022-05-15,Insurance,"American International Group, Inc.",ODVCVCQG2BP6VHV36M30,Instrument,EURO MEDIUM TERM NOTES,,2.875,2015-04-16,350.00,true,Baa1,2012-06-15,HS,Instrument,,Senior Unsecured,,,,45500,NRSRO,820113590,NRSRO,,,,,,,
Moody's Investors Service,2022-05-15,Insurance,"American International Group, Inc.",ODVCVCQG2BP6VHV36M30,Instrument,EURO MEDIUM TERM NOTES,,2.875,2015-04-16,350.00,true,WR,2015-04-16,WE,Instrument,,Senior Unsecured,,,,45500,NRSRO,820113590,NRSRO,,,,,,,
Moody's Investors Service,2022-05-15,Insurance,"American International Group, Inc.",ODVCVCQG2BP6VHV36M30,Instrument,EURO MEDIUM TERM NOTES,,1.825,2016-10-24,20000.00,true,Baa1,2012-06-15,HS,Instrument,,Senior Unsecured,,,,45500,NRSRO,820175498,NRSRO,,,,,,,
Moody's Investors Service,2022-05-15,Insurance,"American International Group, Inc.",ODVCVCQG2BP6VHV36M30,Instrument,EURO MEDIUM TERM NOTES,,1.825,2016-10-24,20000.00,true,WR,2016-10-24,WE,Instrument,,Senior Unsecured,,,,45500,NRSRO,820175498,NRSRO,,,,,,,
Moody's Investors Service,2022-05-15,Insurance,"American International Group, Inc.",ODVCVCQG2BP6VHV36M30,Instrument,EURO MEDIUM TERM NOTES,,4.9,2014-06-02,400.00,true,Baa1,2012-06-15,HS,Instrument,,Senior Unsecured,,,,45500,NRSRO,820294225,NRSRO,,,,,,,
Moody's Investors Service,2022-05-15,Insurance,"American International Group, Inc.",ODVCVCQG2BP6VHV36M30,Instrument,EURO MEDIUM TERM NOTES,,4.9,2014-06-02,400.00,true,WR,2014-06-02,WE,Instrument,,Senior Unsecured,,,,45500,NRSRO,820294225,NRSRO,,,,,,,
Moody's Investors Service,2022-05-15,Insurance,"American International Group, Inc.",ODVCVCQG2BP6VHV36M30,Instrument,EURO MEDIUM TERM NOTES,,3.375,2017-06-29,250.00,true,Baa1,2012-06-15,HS,Instrument,,Senior Unsecured,,,,45500,NRSRO,820309148,NRSRO,,,,,,,
Moody's Investors Service,2022-05-15,Insurance,"American International Group, Inc.",ODVCVCQG2BP6VHV36M30,Instrument,EURO MEDIUM TERM NOTES,,3.375,2017-06-29,250.00,true,WR,2017-06-29,WE,Instrument,,Senior Unsecured,,,,45500,NRSRO,820309148,NRSRO,,,,,,,
Moody's Investors Service,2022-05-15,Insurance,"American International Group, Inc.",ODVCVCQG2BP6VHV36M30,Instrument,EURO MEDIUM TERM NOTES,,5.0,2017-06-26,600.00,true,Baa1,2012-06-15,HS,Instrument,,Senior Unsecured,,,,45500,NRSRO,820360583,NRSRO,,,,,,,
Moody's Investors Service,2022-05-15,Insurance,"American International Group, Inc.",ODVCVCQG2BP6VHV36M30,Instrument,EURO MEDIUM TERM NOTES,,5.0,2017-06-26,600.00,true,WR,2017-06-26,WE,Instrument,,Senior Unsecured,,,,45500,NRSRO,820360583,NRSRO,,,,,,,
Moody's Investors Service,2022-05-15,Insurance,"American International Group, Inc.",ODVCVCQG2BP6VHV36M30,Instrument,EURO MEDIUM TERM NOTES,,2.275,2016-08-08,2000.00,true,Baa1,2012-06-15,HS,Instrument,,Senior Unsecured,,,,45500,NRSRO,820511423,NRSRO,,,,,,,
Moody's Investors Service,2022-05-15,Insurance,"American International Group, Inc.",ODVCVCQG2BP6VHV36M30,Instrument,EURO MEDIUM TERM NOTES,,2.275,2016-08-08,2000.00,true,WR,2016-08-08,WE,Instrument,,Senior Unsecured,,,,45500,NRSRO,820511423,NRSRO,,,,,,,
Moody's Investors Service,2022-05-15,Insurance,"American International Group, Inc.",ODVCVCQG2BP6VHV36M30,Instrument,EURO MEDIUM TERM NOTES,,4.9,2045-09-25,420.00,true,Baa1,2015-09-14,NW,Instrument,,Senior Unsecured,,,,45500,NRSRO,824705692,NRSRO,,,,,,,
Moody's Investors Service,2022-05-15,Insurance,"American International Group, Inc.",ODVCVCQG2BP6VHV36M30,Instrument,EURO MEDIUM TERM NOTES,,4.9,2045-09-25,420.00,true,WR,2017-10-03,WE,Instrument,,Senior Unsecured,,,,45500,NRSRO,824705692,NRSRO,,,,,,,
Moody's Investors Service,2022-05-15,Insurance,"American International Group, Inc.",ODVCVCQG2BP6VHV36M30,Instrument,EUROBONDS,,4.9,2045-07-17,290.00,true,Baa1,2015-07-06,NW,Instrument,,Senior Unsecured,,,,45500,NRSRO,824595570,NRSRO,,,,,,,
Moody's Investors Service,2022-05-15,Insurance,"American International Group, Inc.",ODVCVCQG2BP6VHV36M30,Instrument,EUROBONDS,,4.9,2045-07-17,290.00,true,WR,2017-07-22,WE,Instrument,,Senior Unsecured,,,,45500,NRSRO,824595570,NRSRO,,,,,,,
Moody's Investors Service,2022-05-15,Insurance,"American International Group, Inc.",ODVCVCQG2BP6VHV36M30,Instrument,EUROBONDS,,1.5,2023-06-08,750.00,true,Baa1,2016-06-01,NW,Instrument,,Senior Unsecured,,,,45500,NRSRO,825085826,NRSRO,,,,,,,
Moody's Investors Service,2022-05-15,Insurance,"American International Group, Inc.",ODVCVCQG2BP6VHV36M30,Instrument,EUROBONDS,,1.875,2027-06-21,1000.00,true,Baa1,2017-06-12,NW,Instrument,,Senior Unsecured,,,,45500,NRSRO,825621651,NRSRO,,,,,,,
Moody's Investors Service,2022-05-15,Insurance,"American International Group, Inc.",ODVCVCQG2BP6VHV36M30,Instrument,GLOBAL MTNS,,7.98,2017-06-15,2800.00,true,Baa1,2012-06-15,HS,Instrument,,Senior Unsecured,,,,45500,NRSRO,820314490,NRSRO,,,,,,,
Moody's Investors Service,2022-05-15,Insurance,"American International Group, Inc.",ODVCVCQG2BP6VHV36M30,Instrument,GLOBAL MTNS,,7.98,2017-06-15,2800.00,true,WR,2017-06-15,WE,Instrument,,Senior Unsecured,,,,45500,NRSRO,820314490,NRSRO,,,,,,,